{"text_format":"1","workbook":"xlsx","n_sheets":7,"sheets":["INTRODUCTION","VOLUME INPUT","LOG PRICES","COST INPUT","UNIT SUMMARY","HELP","Module1"],"not_rendered":{"charts":0,"images":4,"macros":1,"external_links":0,"defined_names":25,"comments":4,"pivot_tables":0},"unopened":[{"sheet":"Module1","index":6,"reason":"part_missing"}],"bounds":{"document_bytes":16777216,"sheet_cells":100000,"rows_first":2000,"rows_last":500,"rows_between":2000,"halvings":0,"cell_chars":16384,"cell_head_chars":4096},"cells_cut":0,"cells_raw":0,"read":"whole","date_system":"1900"}

{"sheet":"INTRODUCTION","index":0,"n_rows":1000,"n_cols":1,"rows_kept":1000,"cut":false,"hidden":false,"merged":[]}
[]
[]
[]
[]
[]
[]
{"$rows_left_out":995}
{"sheet":"VOLUME INPUT","index":1,"n_rows":79,"n_cols":68,"rows_kept":79,"cut":false,"hidden":false,"merged":[]}
["UNIT, SPECIES, & VOLUME  DATA  INPUT  SCREEN"]
[null,null,"Sale name",null,null,null,null,null,null,null,null,null,null,null,null,null,null,null,null,null,null,null,null,null,null,null,null,null,null,null,null,null,null,null,null,null,null,null,null,null,null,null,null,null,null,null,null,null,null,null,null,null,null,null,null,null,null,"Name","Index","Name","Code"]
[null,null,"Volume type (select)","CCF",null,null,null,null,null,null,null,null,null,null,null,null,null,null,null,null,null,null,null,null,null,null,null,null,null,null,null,null,null,null,null,null,null,null,null,null,null,null,null,null,null,null,null,null,null,null,null,null,null,null,null,null,null,null,1,null,0]
[null,null,"Forest/district",null,null,null,null,null,null,null,null,null,null,null,null,null,null,null,null,null,null,null,null,null,null,null,null,null,null,null,null,null,null,null,null,null,null,null,null,null,null,null,null,null,null,null,null,null,null,null,null,null,null,null,null,null,null,{"$f":"'LOG PRICES'!V3","v":"Alaska yellow cedar"},2,{"$f":"'LOG PRICES'!V3","v":"Alaska yellow cedar"},{"$f":"'LOG PRICES'!U3","v":42}]
[null,null,"Date",null,null,null,null,null,null,null,null,null,null,null,null,null,null,null,null,null,null,null,null,null,null,null,null,null,null,null,null,null,null,null,null,null,null,null,null,null,null,null,null,null,null,null,null,null,null,null,null,null,null,null,null,null,null,{"$f":"'LOG PRICES'!V4","v":"ash"},3,{"$f":"'LOG PRICES'!V4","v":"ash"},{"$f":"'LOG PRICES'!U4","v":355}]
[null,null,"Species - select from blue-shaded cells below…",null,null,null,null,null,null,null,null,null,null,null,null,null,null,null,null,null,null,null,null,null,null,null,null,null,null,null,null,null,null,null,null,null,null,null,null,null,null,null,null,null,null,null,null,null,null,null,null,null,null,null,null,null,null,{"$f":"'LOG PRICES'!V5","v":"beech"},4,{"$f":"'LOG PRICES'!V5","v":"beech"},{"$f":"'LOG PRICES'!U5","v":362}]
{"$rows_left_out":74}
{"sheet":"LOG PRICES","index":2,"n_rows":44,"n_cols":211,"rows_kept":44,"cut":false,"hidden":false,"merged":[]}
[null,"DELIVERED LOG PRICE DATA INPUT"]
[null,"version 3.1 - RV",null,null,null,null,null,null,null,null,null,null,null,null,null,null,null,null,null,null,"sp number","sp name",null,"min ccf","min mbf",null,null,null,null,null,null,null,null,null,null,null,null,null,null,null,null,null,null,null,null,null,null,null,null,null,null,null,null,null,null,null,null,null,null,null,null,null,null,null,null,null,null,null,null,null,null,null,null,null,null,null,null,null,null,null,null,null,null,null,null,null,null,null,null,null,null,null,null,null,null,null,null,null,null,null,null,null,null,null,null,null,null,null,null,null,null,null,null,null,null,null,null,null,null,null,null,null,null,null,null,null,null,null,null,null,null,null,null,null,null,null,null,null,null,null,null,null,null,null,null,null,null,null,null,null,null,null,null,null,null,null,null,null,null,null,null,null,null,null,null,null,null,null,null,null,null,null,null,null,null,null,null,null,null,null,null,null,null,null,null,null,null,null,null,null,null,null,null,null,null,null,null,null,null,null,null,null,null,null,null,null,null,null,null,"forest #","name"]
[null,"Sale:",{"$f":"IF(ISTEXT('VOLUME INPUT'!D2),'VOLUME INPUT'!D2,\"\")","v":""},null,null,null,null,null,null,null,null,null,null,null,null,null,null,null,null,null,42,"Alaska yellow cedar",null,10,20,null,null,null,null,null,null,null,null,null,null,null,null,null,null,null,null,null,null,null,null,null,null,null,null,null,null,null,null,null,null,null,null,null,null,null,null,null,null,null,null,null,null,null,null,null,null,null,null,null,null,null,null,null,null,null,null,null,null,null,null,null,null,null,null,null,null,null,null,null,null,null,null,null,null,null,null,null,null,null,null,null,null,null,null,null,null,null,null,null,null,null,null,null,null,null,null,null,null,null,null,null,null,null,null,null,null,null,null,null,null,null,null,null,null,null,null,null,null,null,null,null,null,null,null,null,null,null,null,null,null,null,null,null,null,null,null,null,null,null,null,null,null,null,null,null,null,null,null,null,null,null,null,null,null,null,null,null,null,null,null,null,null,null,null,null,null,null,null,null,null,null,null,null,null,null,null,null,null,null,null,null,null,null,null,1,"Deschutes"]
[null,"Date:",{"$f":"IF(ISNUMBER('VOLUME INPUT'!D5),'VOLUME INPUT'!D5,\"\")","v":""},null,null,null,null,null,null,null,null,null,null,null,null,null,null,null,null,null,355,"ash",null,3,5,null,null,null,null,null,null,null,null,null,null,null,null,null,null,null,null,null,null,null,null,null,null,null,null,null,null,null,null,null,null,null,null,null,null,null,null,null,null,null,null,null,null,null,null,null,null,null,null,null,null,null,null,null,null,null,null,null,null,null,null,null,null,null,null,null,null,null,null,null,null,null,null,null,null,null,null,null,null,null,null,null,null,null,null,null,null,null,null,null,null,null,null,null,null,null,null,null,null,null,null,null,null,null,null,null,null,null,null,null,null,null,null,null,null,null,null,null,null,null,null,null,null,null,null,null,null,null,null,null,null,null,null,null,null,null,null,null,null,null,null,null,null,null,null,null,null,null,null,null,null,null,null,null,null,null,null,null,null,null,null,null,null,null,null,null,null,null,null,null,null,null,null,null,null,null,null,null,null,null,null,null,null,null,null,2,"Fremont"]
[null,"Forest/district:",{"$f":"IF(ISTEXT('VOLUME INPUT'!D4),'VOLUME INPUT'!D4,\"\")","v":""},null,null,null,null,null,null,null,null,null,null,null,null,null,null,null,null,null,362,"beech",null,3,5,null,null,null,null,null,null,null,null,null,null,null,null,null,null,null,null,null,null,null,null,null,null,null,null,null,null,null,null,null,null,null,null,null,null,null,null,null,null,null,null,null,null,null,null,null,null,null,null,null,null,null,null,null,null,null,null,null,null,null,null,null,null,null,null,null,null,null,null,null,null,null,null,null,null,null,null,null,null,null,null,null,null,null,null,null,null,null,null,null,null,null,null,null,null,null,null,null,null,null,null,null,null,null,null,null,null,null,null,null,null,null,null,null,null,null,null,null,null,null,null,null,null,null,null,null,null,null,null,null,null,null,null,null,null,null,null,null,null,null,null,null,null,null,null,null,null,null,null,null,null,null,null,null,null,null,null,null,null,null,null,null,null,null,null,null,null,null,null,null,null,null,null,null,null,null,null,null,null,null,null,null,null,null,null,3,"Gifford Pinchot"]
[null,"Volume type:",{"$f":"IF(ISTEXT('VOLUME INPUT'!D3),'VOLUME INPUT'!D3,\"\")","v":"CCF"},null,null,null,null,null,null,null,null,null,null,null,null,null,null,null,null,null,357,"birch",null,3,5,null,null,null,null,null,null,null,null,null,null,null,null,null,null,null,null,null,null,null,null,null,null,null,null,null,null,null,null,null,null,null,null,null,null,null,null,null,null,null,null,null,null,null,null,null,null,null,null,null,null,null,null,null,null,null,null,null,null,null,null,null,null,null,null,null,null,null,null,null,null,null,null,null,null,null,null,null,null,null,null,null,null,null,null,null,null,null,null,null,null,null,null,null,null,null,null,null,null,null,null,null,null,null,null,null,null,null,null,null,null,null,null,null,null,null,null,null,null,null,null,null,null,null,null,null,null,null,null,null,null,null,null,null,null,null,null,null,null,null,null,null,null,null,null,null,null,null,null,null,null,null,null,null,null,null,null,null,null,null,null,null,null,null,null,null,null,null,null,null,null,null,null,null,null,null,null,null,null,null,null,null,null,null,null,5,"Mt. Baker-Snoqualmie"]
{"$rows_left_out":39}
{"sheet":"COST INPUT","index":3,"n_rows":68,"n_cols":39,"rows_kept":68,"cut":false,"hidden":false,"merged":[[4,9,6,9],[5,6,6,6],[2,1,2,2],[3,1,3,2],[4,0,6,0],[5,1,6,1],[5,2,6,2],[4,1,4,8],[5,8,6,8],[5,7,6,7],[5,4,6,4],[5,5,6,5],[5,3,6,3]]}
["LOGGING & ASSOCIATED COSTS DATA INPUT"]
["version 3.1 - RV"]
["Sale name:",{"$f":"IF(ISTEXT('VOLUME INPUT'!D2),'VOLUME INPUT'!D2,\"\")","v":""},null,"Vol type:",{"$f":"'VOLUME INPUT'!D3","v":"CCF"},null,null,null,null,null,null,null,null,null,null,null,null,null,null,null,null,null,null,null,null,null,null,null,null,null,null,null,null,null,null,null,"rt = ","round trip"]
["For/district:",{"$f":"IF(ISTEXT('VOLUME INPUT'!D4),'VOLUME INPUT'!D4,\"\")","v":""},null,"Date:",{"$f":"IF(ISNUMBER('VOLUME INPUT'!D5),'VOLUME INPUT'!D5,\"\")","v":""},null,null,null,null,null,null,null,null,null,null,null,null,null,null,null,null,null,null,null,null,null,null,null,null,null,null,null,null,null,null,null,"rtm = ","round trip minutes"]
["Unit",{"$f":"\"INPUT  SALE/UNIT  SPECIFIC  COSTS  IN  $'s  PER \"&IF('VOLUME INPUT'!$D$3=\"MBF\",\"MBF\",\"CCF\")&\"   \"","v":"INPUT  SALE/UNIT  SPECIFIC  COSTS  IN  $'s  PER CCF   "},null,null,null,null,null,null,null,{"$f":"\"$/\"&IF('VOLUME INPUT'!$D$3=\"MBF\",\"mbf\",\"ccf\")&\" above, (below) base rate\"","v":"$/ccf above, (below) base rate"},null,null,null,null,null,null,null,null,null,null,null,null,null,null,null,null,null,null,null,null,null,null,null,null,null,null,"Volume type = ",{"$f":"'VOLUME INPUT'!D3","v":"CCF"}]
[null,{"$f":"\"$/\"&IF('VOLUME INPUT'!$D$3=\"MBF\",\"mbf\",\"ccf\")&\" Stump-to-truck\"","v":"$/ccf Stump-to-truck"},"Log haul distance - mi (one way)",{"$f":"\"$/\"&IF('VOLUME INPUT'!$D$3=\"MBF\",\"mbf\",\"ccf\")&\" Road Maintenance\"","v":"$/ccf Road Maintenance"},{"$f":"\"$/\"&IF('VOLUME INPUT'!$D$3=\"MBF\",\"mbf\",\"ccf\")&\" BD & Erosion\"","v":"$/ccf BD & Erosion"},{"$f":"\"$/\"&IF('VOLUME INPUT'!$D$3=\"MBF\",\"mbf\",\"ccf\")&\" Temp Roads\"","v":"$/ccf Temp Roads"},{"$f":"\"$/\"&IF('VOLUME INPUT'!$D$3=\"MBF\",\"mbf\",\"ccf\")&\" Spec Con/Recon\"","v":"$/ccf Spec Con/Recon"},{"$f":"\"$/\"&IF('VOLUME INPUT'!$D$3=\"MBF\",\"mbf\",\"ccf\")&\" Unusual\"","v":"$/ccf Unusual"},{"$f":"\"$/\"&IF('VOLUME INPUT'!$D$3=\"MBF\",\"mbf\",\"ccf\")&\" Essential KV\"","v":"$/ccf Essential KV"},null,null,null,null,null,null,null,null,null,null,null,null,null,null,null,null,null,null,null,"Haul Cost Calculations and Defaults…",null,null,null,null,null,null,"current default is $1.6/minute for truck"]
{"$rows_left_out":63}
{"sheet":"UNIT SUMMARY","index":4,"n_rows":529,"n_cols":50,"rows_kept":529,"cut":false,"hidden":false,"merged":[[69,9,70,9],[68,5,68,9],[4,0,5,0],[4,6,5,6],[4,9,5,9],[4,8,5,8],[4,7,5,7],[4,2,5,2],[4,3,5,3],[4,5,5,5],[2,1,2,2],[69,1,69,3],[68,1,68,3],[69,5,70,8],[70,1,70,3],[4,1,5,1],[3,1,3,2],[4,4,5,4],[510,9,511,9],[507,6,507,7],[507,8,507,9],[510,8,511,8],[509,6,511,6],[509,7,511,7],[71,1,71,3],[71,5,71,8],[521,0,521,2],[521,6,521,7],[507,2,507,3],[507,0,507,1],[507,4,507,5],[509,4,511,4],[509,5,511,5]]}
["ECONOMIC SUMMARY - VALUE ANALYSIS"]
["version 3.0 - RV",null,null,null,null,null,null,null,null,null,null,null,null,null,null,null,null,null,null,null,null,null,null,null,null,null,null,null,null,null,null,null,null,null,null,null,null,null,null,null,null,null,null,null,null,null,null,null,null,"Comp Factor"]
["Sale Name:",{"$f":"IF(ISTEXT('VOLUME INPUT'!D2),'VOLUME INPUT'!D2,\"\")","v":""},null,"Date:",{"$f":"IF(ISNUMBER('VOLUME INPUT'!D5),'VOLUME INPUT'!D5,\"\")","v":""},"Profit/risk %:",null,null,null,null,null,null,null,null,null,null,null,null,null,null,null,null,null,null,null,null,null,null,null,null,null,null,null,null,null,null,null,null,null,null,null,null,null,null,null,null,null,null,null,0]
["Forest/district:",{"$f":"IF(ISTEXT('VOLUME INPUT'!D4),'VOLUME INPUT'!D4,\"\")","v":""},null,"Vol type:",{"$f":"'VOLUME INPUT'!D3","v":"CCF"}]
["Unit",{"$f":"\"Tot Volume \"&IF('VOLUME INPUT'!$D$3=\"MBF\",\"MBF\",\"CCF\")","v":"Tot Volume CCF"},{"$f":"\"$/\"&IF('VOLUME INPUT'!$D$3=\"MBF\",\"mbf\",\"ccf\")&\" Pred. High Bid\"","v":"$/ccf Pred. High Bid"},{"$f":"\"$/\"&IF('VOLUME INPUT'!$D$3=\"MBF\",\"mbf\",\"ccf\")&\" Base Rate\"","v":"$/ccf Base Rate"},{"$f":"\"$/\"&IF('VOLUME INPUT'!$D$3=\"MBF\",\"mbf\",\"ccf\")&\" Ind. Ad Rate\"","v":"$/ccf Ind. Ad Rate"},{"$f":"\"$/\"&IF('VOLUME INPUT'!$D$3=\"MBF\",\"mbf\",\"ccf\")&\" Ad Rate\"","v":"$/ccf Ad Rate"},"Tot gross-$ Timber Value","Total-$ Ess KV","Is Unit/sale Deficit?","Value at Ind. Ad Rate",null,null,null,null,null,null,null,null,null,null,null,null,null,null,null,null,"P  R  E  D  I  C  T  E  D     H  I  G  H     B  I  D     T  A  B  L  E",null,null,null,null,null,null,null,null,"B  A  S  E     R  A  T  E     T  A  B  L  E"]
[null,null,null,null,null,null,null,null,null,null,null,null,null,null,null,null,null,null,null,null,null,null,null,null,null,"unit",{"$f":"IF('VOLUME INPUT'!$BK9>1,VLOOKUP('VOLUME INPUT'!$BK9,'VOLUME INPUT'!$BG$3:$BI$45,3),\"\")","v":""},{"$f":"IF('VOLUME INPUT'!$BL9>1,VLOOKUP('VOLUME INPUT'!$BL9,'VOLUME INPUT'!$BG$3:$BI$45,3),\"\")","v":""},{"$f":"IF('VOLUME INPUT'!$BM9>1,VLOOKUP('VOLUME INPUT'!$BM9,'VOLUME INPUT'!$BG$3:$BI$45,3),\"\")","v":""},{"$f":"IF('VOLUME INPUT'!$BN9>1,VLOOKUP('VOLUME INPUT'!$BN9,'VOLUME INPUT'!$BG$3:$BI$45,3),\"\")","v":""},{"$f":"IF('VOLUME INPUT'!$BO9>1,VLOOKUP('VOLUME INPUT'!$BO9,'VOLUME INPUT'!$BG$3:$BI$45,3),\"\")","v":""},{"$f":"IF('VOLUME INPUT'!$BP9>1,VLOOKUP('VOLUME INPUT'!$BP9,'VOLUME INPUT'!$BG$3:$BI$45,3),\"\")","v":""},null,"avg-hb","unit",{"$f":"AA6","v":""},"","","","","",null,"avg-min","kv","used",null,null,"P & R",null,"Comp Adj"]
{"$rows_left_out":524}
{"sheet":"HELP","index":5,"n_rows":62,"n_cols":1,"rows_kept":62,"cut":false,"hidden":false,"merged":[[0,0,0,7],[1,0,1,7]]}
["Sale Evaluation Spreadsheet - Help"]
["version 3.0 - RV"]
["VOLUME INPUT screen"]
["This spreadsheet is intended for use in evaluating the economics of a timber sale or"]
["sales.  The spreadsheet has the ability to evaluate by individual units or an entire"]
["sales (sale-as-a-whole).  If the user wishes to evaluate by unit, then enter unit numbers"]
{"$rows_left_out":56}